{"text_format":"1","workbook":"xlsx","n_sheets":2,"sheets":["Status på frit valg i kommunen","Grunddata"],"not_rendered":{"charts":0,"images":1,"macros":1,"external_links":0,"defined_names":7,"comments":1,"pivot_tables":0},"unopened":[],"bounds":{"document_bytes":16777216,"sheet_cells":100000,"rows_first":2000,"rows_last":500,"rows_between":2000,"halvings":0,"cell_chars":16384,"cell_head_chars":4096},"cells_cut":0,"cells_raw":0,"read":"whole","date_system":"1900"}

{"sheet":"Status på frit valg i kommunen","index":0,"n_rows":82,"n_cols":20,"rows_kept":82,"cut":false,"hidden":false,"merged":[[71,2,71,16],[78,2,78,16],[81,2,81,16],[75,2,75,16],[47,15,47,16],[52,15,52,16],[57,15,57,16],[64,13,64,17],[62,13,62,17],[62,2,63,8],[65,13,66,17],[5,2,6,17],[63,13,63,17],[30,2,31,17],[43,13,43,17],[19,2,21,17],[25,2,26,17],[43,2,44,10],[44,13,45,17]]}
[]
[]
[]
[null,null,"Kære læser"]
[]
[null,null,"Følgende værktøj giver et overblik over, hvordan din kommune klarer sig i forhold til at sikre kommunens borgere frit valg på velfærdsområderne. \nVi har taget udgangspunkt i områderne: dagpasning, hjemmehjælp og plejehjem. Alle er områder hvor mange kommuner langt fra er gode nok til at informere og sikre, at borgere, pårørende og forældre kan vælge netop det tilbud, som de mener, opfylder deres ønsker bedst."]
[]
[]
[null,null,"Sådan gør du:"]
[null,null,"Du kan nu vælge din kommune i nedenstående. Derudover kan du vælge op til tre andre kommuner, som du gerne vil sammenligne med. "]
[]
[null,null,"Vælg din kommune her: ",null,null,null,"Albertslund"]
[]
[null,null,"Vælg tre kommuner til sammenligning her:",null,null,null,"Allerød"]
[null,null,null,null,null,null,"Assens"]
[null,null,null,null,null,null,"Ballerup"]
[]
[]
[null,null,"Hvad kan du gøre?"]
[null,null,"Vi har samlet en række forslag til, hvordan du helt konkret kan sikre, at borgerne i den kommune, som du er valgt til at repræsentere, har muligheden for at bruge deres frie valg. Det behøver hverken at være kompliceret, omstændigt eller dyrt. Faktisk er der mange lavthængende frugter, som du og resten af kommunalbestyrelsen kan tage fat på. "]
[]
[]
[null,null,"Se DI's anbefalinger her."]
[]
[null,null,"Hvis du vil vide mere:"]
[null,null,"Frit valg er både lokalt og nationalt. I DI arbejder på begge fronter for at sikre mangfoldighed og variation af velfærdstilbuddene til borgere i hele landet. Du kan læse mere om vores egne forslag til at styrke det frie valg eller vores generelle arbejde på velfærdsområderne her."]
[]
[]
[]
[]
[null,null,"Hvis du har spørgsmål eller ønsker at vide mere om, hvordan du i din kommune kan udbrede viden om det frie valg, skal du endelig ikke tøve med at kontakte os: "]
[]
[null,null,"Lars Bech-Jørgensen",null,null,null,"Christian Broholm Andersen"]
[null,null,"Fagleder, Offentlig/Privat og velfærdspolitik",null,null,null,"Konsulent, Offentlig/Privat og velfærdspolitik"]
[null,null,"Direkte: +45 3377 4671",null,null,null,"Direkte: +45 3377 3516"]
[null,null,"Mobil: +45 2627 1949",null,null,null,"Mobil: +45 5218 5959"]
[null,null,"E-mail: lbej@di.dk",null,null,null,"E-mail: chra@di.dk"]
[]
[]
[]
[]
[]
[]
[null,null,{"$f":"G12&\" \"&IF(VLOOKUP(G12,Grunddata!A:Q,17,FALSE)=0,\"har på nuværende tidspunkt ikke et privat alternativ til de kommunale plejeboliger\",\"har et privat alternativ til de kommunale plejeboliger\")","v":"Albertslund har på nuværende tidspunkt ikke et privat alternativ til de kommunale plejeboliger"},null,null,null,null,null,null,null,null,null,null,"Information til borgerne om muligheder ved det frie valg i udvalgte kommuner"]
[null,null,null,null,null,null,null,null,null,null,null,null,null,"Overblik over tilgængelig information fra DI's gennemgang af kommunernes hjemmesider for plejebolig-, hjemmepleje- og daginstitutionsområdet. Hold musen over informationstyperne for uddybende forklaring."]
[]
[null,null,null,null,null,null,null,null,null,null,null,null,null,null,{"$f":"IF(G12=\"Lyngby-Taarbæk\",G12&\"*\",G12)","v":"Albertslund"},{"$f":"IF(G14=\"Lyngby-Taarbæk\",G14&\"*\",G14)","v":"Allerød"},{"$f":"IF(G15=\"Lyngby-Taarbæk\",G15&\"*\",G15)","v":"Assens"},{"$f":"IF(G16=\"Lyngby-Taarbæk\",G16&\"*\",G16)","v":"Ballerup"}]
[null,null,null,null,null,null,null,null,null,null,null,null,null,null,null,"Plejebolig"]
[null,null,null,null,null,null,null,null,null,null,null,null,null,"Rettigheder",{"$f":"IF(VLOOKUP(O$47,Grunddata!$A:$P,2,FALSE)=\"N/A\",3,VLOOKUP(O$47,Grunddata!$A:$P,2,FALSE))","v":0},{"$f":"IF(VLOOKUP(P$47,Grunddata!$A:$P,2,FALSE)=\"N/A\",3,VLOOKUP(P$47,Grunddata!$A:$P,2,FALSE))","v":0},{"$f":"IF(VLOOKUP(Q$47,Grunddata!$A:$P,2,FALSE)=\"N/A\",3,VLOOKUP(Q$47,Grunddata!$A:$P,2,FALSE))","v":1},{"$f":"IF(VLOOKUP(R$47,Grunddata!$A:$P,2,FALSE)=\"N/A\",3,VLOOKUP(R$47,Grunddata!$A:$P,2,FALSE))","v":0}]
[null,null,null,null,null,null,null,null,null,null,null,null,null,"Valgmuligheder",{"$f":"IF(VLOOKUP(O$47,Grunddata!$A:$P,3,FALSE)=\"N/A\",3,VLOOKUP(O$47,Grunddata!$A:$P,3,FALSE))","v":0},{"$f":"IF(VLOOKUP(P$47,Grunddata!$A:$P,3,FALSE)=\"N/A\",3,VLOOKUP(P$47,Grunddata!$A:$P,3,FALSE))","v":1},{"$f":"IF(VLOOKUP(Q$47,Grunddata!$A:$P,3,FALSE)=\"N/A\",3,VLOOKUP(Q$47,Grunddata!$A:$P,3,FALSE))","v":1},{"$f":"IF(VLOOKUP(R$47,Grunddata!$A:$P,3,FALSE)=\"N/A\",3,VLOOKUP(R$47,Grunddata!$A:$P,3,FALSE))","v":1}]
[null,null,null,null,null,null,null,null,null,null,null,null,null,"Undersøgelse af den brugeroplevet kvalitet",{"$f":"IF(VLOOKUP(O$47,Grunddata!$A:$P,4,FALSE)=\"N/A\",3,VLOOKUP(O$47,Grunddata!$A:$P,4,FALSE))","v":0},{"$f":"IF(VLOOKUP(P$47,Grunddata!$A:$P,4,FALSE)=\"N/A\",3,VLOOKUP(P$47,Grunddata!$A:$P,4,FALSE))","v":0},{"$f":"IF(VLOOKUP(Q$47,Grunddata!$A:$P,4,FALSE)=\"N/A\",3,VLOOKUP(Q$47,Grunddata!$A:$P,4,FALSE))","v":0},{"$f":"IF(VLOOKUP(R$47,Grunddata!$A:$P,4,FALSE)=\"N/A\",3,VLOOKUP(R$47,Grunddata!$A:$P,4,FALSE))","v":0}]
[null,null,null,null,null,null,null,null,null,null,null,null,null,"Aktuel information",{"$f":"IF(VLOOKUP(O$47,Grunddata!$A:$P,5,FALSE)=\"N/A\",3,VLOOKUP(O$47,Grunddata!$A:$P,5,FALSE))","v":0},{"$f":"IF(VLOOKUP(P$47,Grunddata!$A:$P,5,FALSE)=\"N/A\",3,VLOOKUP(P$47,Grunddata!$A:$P,5,FALSE))","v":0},{"$f":"IF(VLOOKUP(Q$47,Grunddata!$A:$P,5,FALSE)=\"N/A\",3,VLOOKUP(Q$47,Grunddata!$A:$P,5,FALSE))","v":0},{"$f":"IF(VLOOKUP(R$47,Grunddata!$A:$P,5,FALSE)=\"N/A\",3,VLOOKUP(R$47,Grunddata!$A:$P,5,FALSE))","v":0}]
[null,null,null,null,null,null,null,null,null,null,null,null,null,null,null,"Hjemmepleje"]
[null,null,null,null,null,null,null,null,null,null,null,null,null,"Rettigheder",{"$f":"IF(VLOOKUP(O$47,Grunddata!$A:$P,7,FALSE)=\"N/A\",3,VLOOKUP(O$47,Grunddata!$A:$P,7,FALSE))","v":1},{"$f":"IF(VLOOKUP(P$47,Grunddata!$A:$P,7,FALSE)=\"N/A\",3,VLOOKUP(P$47,Grunddata!$A:$P,7,FALSE))","v":2},{"$f":"IF(VLOOKUP(Q$47,Grunddata!$A:$P,7,FALSE)=\"N/A\",3,VLOOKUP(Q$47,Grunddata!$A:$P,7,FALSE))","v":0},{"$f":"IF(VLOOKUP(R$47,Grunddata!$A:$P,7,FALSE)=\"N/A\",3,VLOOKUP(R$47,Grunddata!$A:$P,7,FALSE))","v":1}]
[null,null,null,null,null,null,null,null,null,null,null,null,null,"Valgmuligheder",{"$f":"IF(VLOOKUP(O$47,Grunddata!$A:$P,8,FALSE)=\"N/A\",3,VLOOKUP(O$47,Grunddata!$A:$P,8,FALSE))","v":1},{"$f":"IF(VLOOKUP(P$47,Grunddata!$A:$P,8,FALSE)=\"N/A\",3,VLOOKUP(P$47,Grunddata!$A:$P,8,FALSE))","v":1},{"$f":"IF(VLOOKUP(Q$47,Grunddata!$A:$P,8,FALSE)=\"N/A\",3,VLOOKUP(Q$47,Grunddata!$A:$P,8,FALSE))","v":3},{"$f":"IF(VLOOKUP(R$47,Grunddata!$A:$P,8,FALSE)=\"N/A\",3,VLOOKUP(R$47,Grunddata!$A:$P,8,FALSE))","v":1}]
[null,null,null,null,null,null,null,null,null,null,null,null,null,"Undersøgelse af den brugeroplevet kvalitet",{"$f":"IF(VLOOKUP(O$47,Grunddata!$A:$P,9,FALSE)=\"N/A\",3,VLOOKUP(O$47,Grunddata!$A:$P,9,FALSE))","v":0},{"$f":"IF(VLOOKUP(P$47,Grunddata!$A:$P,9,FALSE)=\"N/A\",3,VLOOKUP(P$47,Grunddata!$A:$P,9,FALSE))","v":0},{"$f":"IF(VLOOKUP(Q$47,Grunddata!$A:$P,9,FALSE)=\"N/A\",3,VLOOKUP(Q$47,Grunddata!$A:$P,9,FALSE))","v":0},{"$f":"IF(VLOOKUP(R$47,Grunddata!$A:$P,9,FALSE)=\"N/A\",3,VLOOKUP(R$47,Grunddata!$A:$P,9,FALSE))","v":0},null,{"$f":"COUNTIF(O54:R57,3)","v":1}]
[null,null,null,null,null,null,null,null,null,null,null,null,null,"Aktuel information",{"$f":"IF(VLOOKUP(O$47,Grunddata!$A:$P,10,FALSE)=\"N/A\",3,VLOOKUP(O$47,Grunddata!$A:$P,10,FALSE))","v":0},{"$f":"IF(VLOOKUP(P$47,Grunddata!$A:$P,10,FALSE)=\"N/A\",3,VLOOKUP(P$47,Grunddata!$A:$P,10,FALSE))","v":0},{"$f":"IF(VLOOKUP(Q$47,Grunddata!$A:$P,10,FALSE)=\"N/A\",3,VLOOKUP(Q$47,Grunddata!$A:$P,10,FALSE))","v":0},{"$f":"IF(VLOOKUP(R$47,Grunddata!$A:$P,10,FALSE)=\"N/A\",3,VLOOKUP(R$47,Grunddata!$A:$P,10,FALSE))","v":0}]
[null,null,null,null,null,null,null,null,null,null,null,null,null,null,null,"Daginstitutioner"]
[null,null,null,null,null,null,null,null,null,null,null,null,null,"Rettigheder",{"$f":"IF(VLOOKUP(O$47,Grunddata!$A:$P,12,FALSE)=\"N/A\",3,VLOOKUP(O$47,Grunddata!$A:$P,12,FALSE))","v":0},{"$f":"IF(VLOOKUP(P$47,Grunddata!$A:$P,12,FALSE)=\"N/A\",3,VLOOKUP(P$47,Grunddata!$A:$P,12,FALSE))","v":0},{"$f":"IF(VLOOKUP(Q$47,Grunddata!$A:$P,12,FALSE)=\"N/A\",3,VLOOKUP(Q$47,Grunddata!$A:$P,12,FALSE))","v":1},{"$f":"IF(VLOOKUP(R$47,Grunddata!$A:$P,12,FALSE)=\"N/A\",3,VLOOKUP(R$47,Grunddata!$A:$P,12,FALSE))","v":0}]
[null,null,null,null,null,null,null,null,null,null,null,null,null,"Valgmuligheder",{"$f":"IF(VLOOKUP(O$47,Grunddata!$A:$P,13,FALSE)=\"N/A\",3,VLOOKUP(O$47,Grunddata!$A:$P,13,FALSE))","v":0},{"$f":"IF(VLOOKUP(P$47,Grunddata!$A:$P,13,FALSE)=\"N/A\",3,VLOOKUP(P$47,Grunddata!$A:$P,13,FALSE))","v":0},{"$f":"IF(VLOOKUP(Q$47,Grunddata!$A:$P,13,FALSE)=\"N/A\",3,VLOOKUP(Q$47,Grunddata!$A:$P,13,FALSE))","v":1},{"$f":"IF(VLOOKUP(R$47,Grunddata!$A:$P,13,FALSE)=\"N/A\",3,VLOOKUP(R$47,Grunddata!$A:$P,13,FALSE))","v":0}]
{"$rows_left_out":23}
{"sheet":"Grunddata","index":1,"n_rows":135,"n_cols":17,"rows_kept":135,"cut":false,"hidden":false,"merged":[]}
[null,"Plejebolig",null,null,null,null,"Hjemmehjælp",null,null,null,null,"Daginstitutioner",null,null,null,null,"Friplejeboliger"]
["Kommunenavn","Rettigheder (0-2)","Valgmuligheder (0-1)","Brugertilfredshed (0-2)","Troværdig information (0-1)","Samlet","Rettigheder (0-2)","Valgmuligheder (0-1)","Brugertilfredshed (0-2)","Troværdig information (0-1)","Samlet","Rettigheder (0-2)","Valgmuligheder (0-1)","Brugertilfredshed (0-2)","Troværdig information (0-1)","Samlet","1=privat alternativ, 0=ikke privat alternativ"]
["Albertslund",0,0,0,0,{"$f":"SUM(Table13[[#This Row],[Rettigheder (0-2)]:[Troværdig information (0-1)]])","v":0},1,1,0,0,{"$f":"SUM(Table1[[#This Row],[Rettigheder (0-2)]:[Troværdig information (0-1)]])","v":2},0,0,0,0,{"$f":"SUM(L3+M3+N3+O3)","v":0},0]
["Allerød",0,1,0,0,{"$f":"SUM(Table13[[#This Row],[Rettigheder (0-2)]:[Troværdig information (0-1)]])","v":1},2,1,0,0,{"$f":"SUM(Table1[[#This Row],[Rettigheder (0-2)]:[Troværdig information (0-1)]])","v":3},0,0,0,0,0,0]
["Assens",1,1,0,0,{"$f":"SUM(Table13[[#This Row],[Rettigheder (0-2)]:[Troværdig information (0-1)]])","v":2},0,"N/A",0,0,{"$f":"SUM(Table1[[#This Row],[Rettigheder (0-2)]:[Troværdig information (0-1)]])","v":0},1,1,0,0,2,0]
["Ballerup",0,1,0,0,{"$f":"SUM(Table13[[#This Row],[Rettigheder (0-2)]:[Troværdig information (0-1)]])","v":1},1,1,0,0,{"$f":"SUM(Table1[[#This Row],[Rettigheder (0-2)]:[Troværdig information (0-1)]])","v":2},0,0,0,0,0,0]
["Billund",0,1,0,0,{"$f":"SUM(Table13[[#This Row],[Rettigheder (0-2)]:[Troværdig information (0-1)]])","v":1},1,0,0,0,{"$f":"SUM(Table1[[#This Row],[Rettigheder (0-2)]:[Troværdig information (0-1)]])","v":1},0,0,0,0,0,1]
["Bornholm",0,1,0,1,{"$f":"SUM(Table13[[#This Row],[Rettigheder (0-2)]:[Troværdig information (0-1)]])","v":2},1,1,2,1,{"$f":"SUM(Table1[[#This Row],[Rettigheder (0-2)]:[Troværdig information (0-1)]])","v":5},1,0,0,0,1,0]
["Brøndby",1,1,0,1,{"$f":"SUM(Table13[[#This Row],[Rettigheder (0-2)]:[Troværdig information (0-1)]])","v":3},1,0,0,1,{"$f":"SUM(Table1[[#This Row],[Rettigheder (0-2)]:[Troværdig information (0-1)]])","v":2},0,0,0,0,0,0]
["Brønderslev",1,1,0,1,{"$f":"SUM(Table13[[#This Row],[Rettigheder (0-2)]:[Troværdig information (0-1)]])","v":3},1,1,0,1,{"$f":"SUM(Table1[[#This Row],[Rettigheder (0-2)]:[Troværdig information (0-1)]])","v":3},0,0,0,1,1,1]
["Dragør",0,0,0,0,{"$f":"SUM(Table13[[#This Row],[Rettigheder (0-2)]:[Troværdig information (0-1)]])","v":0},1,1,0,0,{"$f":"SUM(Table1[[#This Row],[Rettigheder (0-2)]:[Troværdig information (0-1)]])","v":2},0,1,0,0,1,0]
["Egedal",0,1,0,1,{"$f":"SUM(Table13[[#This Row],[Rettigheder (0-2)]:[Troværdig information (0-1)]])","v":2},1,1,0,1,{"$f":"SUM(Table1[[#This Row],[Rettigheder (0-2)]:[Troværdig information (0-1)]])","v":3},0,0,0,1,1,0]
["Esbjerg",0,1,0,0,{"$f":"SUM(Table13[[#This Row],[Rettigheder (0-2)]:[Troværdig information (0-1)]])","v":1},1,1,0,0,{"$f":"SUM(Table1[[#This Row],[Rettigheder (0-2)]:[Troværdig information (0-1)]])","v":2},0,1,0,0,1,1]
["Fanø",1,1,0,0,{"$f":"SUM(Table13[[#This Row],[Rettigheder (0-2)]:[Troværdig information (0-1)]])","v":2},2,"N/A",0,0,{"$f":"SUM(Table1[[#This Row],[Rettigheder (0-2)]:[Troværdig information (0-1)]])","v":2},"N/A","N/A","N/A",0,".",0]
["Favrskov",0,0,0,1,{"$f":"SUM(Table13[[#This Row],[Rettigheder (0-2)]:[Troværdig information (0-1)]])","v":1},1,1,0,1,{"$f":"SUM(Table1[[#This Row],[Rettigheder (0-2)]:[Troværdig information (0-1)]])","v":3},0,0,2,1,{"$f":"SUM(L15+M15+N15+O15)","v":3},1]
["Faxe",0,1,0,1,{"$f":"SUM(Table13[[#This Row],[Rettigheder (0-2)]:[Troværdig information (0-1)]])","v":2},0,0,0,1,{"$f":"SUM(Table1[[#This Row],[Rettigheder (0-2)]:[Troværdig information (0-1)]])","v":1},1,0,0,1,2,0]
["Fredensborg",0,1,0,1,{"$f":"SUM(Table13[[#This Row],[Rettigheder (0-2)]:[Troværdig information (0-1)]])","v":2},1,1,0,0,{"$f":"SUM(Table1[[#This Row],[Rettigheder (0-2)]:[Troværdig information (0-1)]])","v":2},0,0,0,0,0,0]
["Fredericia",0,1,0,1,{"$f":"SUM(Table13[[#This Row],[Rettigheder (0-2)]:[Troværdig information (0-1)]])","v":2},2,1,0,0,{"$f":"SUM(Table1[[#This Row],[Rettigheder (0-2)]:[Troværdig information (0-1)]])","v":3},0,1,0,0,1,0]
["Frederiksberg",0,1,0,0,{"$f":"SUM(Table13[[#This Row],[Rettigheder (0-2)]:[Troværdig information (0-1)]])","v":1},0,0,2,0,{"$f":"SUM(Table1[[#This Row],[Rettigheder (0-2)]:[Troværdig information (0-1)]])","v":2},0,1,0,0,1,1]
["Frederikshavn",0,1,0,0,{"$f":"SUM(Table13[[#This Row],[Rettigheder (0-2)]:[Troværdig information (0-1)]])","v":1},1,1,0,0,{"$f":"SUM(Table1[[#This Row],[Rettigheder (0-2)]:[Troværdig information (0-1)]])","v":2},0,0,0,0,0,0]
["Frederikssund",0,1,0,1,{"$f":"SUM(Table13[[#This Row],[Rettigheder (0-2)]:[Troværdig information (0-1)]])","v":2},1,1,1,0,{"$f":"SUM(Table1[[#This Row],[Rettigheder (0-2)]:[Troværdig information (0-1)]])","v":3},0,0,0,0,0,1]
["Furesø",1,1,0,1,{"$f":"SUM(Table13[[#This Row],[Rettigheder (0-2)]:[Troværdig information (0-1)]])","v":3},1,1,0,1,{"$f":"SUM(Table1[[#This Row],[Rettigheder (0-2)]:[Troværdig information (0-1)]])","v":3},0,0,0,1,1,0]
["Faaborg-Midtfyn",0,1,0,0,{"$f":"SUM(Table13[[#This Row],[Rettigheder (0-2)]:[Troværdig information (0-1)]])","v":1},1,1,0,0,{"$f":"SUM(Table1[[#This Row],[Rettigheder (0-2)]:[Troværdig information (0-1)]])","v":2},2,1,0,0,3,0]
["Gentofte",0,1,0,1,{"$f":"SUM(Table13[[#This Row],[Rettigheder (0-2)]:[Troværdig information (0-1)]])","v":2},2,1,0,1,{"$f":"SUM(Table1[[#This Row],[Rettigheder (0-2)]:[Troværdig information (0-1)]])","v":4},1,0,0,0,1,0]
["Gladsaxe",0,1,0,0,{"$f":"SUM(Table13[[#This Row],[Rettigheder (0-2)]:[Troværdig information (0-1)]])","v":1},1,1,0,1,{"$f":"SUM(Table1[[#This Row],[Rettigheder (0-2)]:[Troværdig information (0-1)]])","v":3},"N/A","N/A","N/A",0,".",0]
["Glostrup",0,1,0,0,{"$f":"SUM(Table13[[#This Row],[Rettigheder (0-2)]:[Troværdig information (0-1)]])","v":1},1,1,2,1,{"$f":"SUM(Table1[[#This Row],[Rettigheder (0-2)]:[Troværdig information (0-1)]])","v":5},0,0,0,0,{"$f":"SUM(L26+M26+N26+O26)","v":0},0]
["Greve",0,1,1,1,{"$f":"SUM(Table13[[#This Row],[Rettigheder (0-2)]:[Troværdig information (0-1)]])","v":3},1,1,0,1,{"$f":"SUM(Table1[[#This Row],[Rettigheder (0-2)]:[Troværdig information (0-1)]])","v":3},0,0,0,1,1,1]
["Gribskov",0,1,1,1,{"$f":"SUM(Table13[[#This Row],[Rettigheder (0-2)]:[Troværdig information (0-1)]])","v":3},1,1,1,1,{"$f":"SUM(Table1[[#This Row],[Rettigheder (0-2)]:[Troværdig information (0-1)]])","v":4},0,0,0,0,0,1]
["Guldborgsund",0,1,0,0,{"$f":"SUM(Table13[[#This Row],[Rettigheder (0-2)]:[Troværdig information (0-1)]])","v":1},1,1,0,1,{"$f":"SUM(Table1[[#This Row],[Rettigheder (0-2)]:[Troværdig information (0-1)]])","v":3},1,0,0,0,1,1]
["Haderslev",0,1,0,0,{"$f":"SUM(Table13[[#This Row],[Rettigheder (0-2)]:[Troværdig information (0-1)]])","v":1},1,1,0,0,{"$f":"SUM(Table1[[#This Row],[Rettigheder (0-2)]:[Troværdig information (0-1)]])","v":2},0,1,0,0,1,1]
["Halsnæs",0,1,0,0,{"$f":"SUM(Table13[[#This Row],[Rettigheder (0-2)]:[Troværdig information (0-1)]])","v":1},1,1,0,0,{"$f":"SUM(Table1[[#This Row],[Rettigheder (0-2)]:[Troværdig information (0-1)]])","v":2},1,0,0,0,1,0]
["Hedensted",0,1,0,0,{"$f":"SUM(Table13[[#This Row],[Rettigheder (0-2)]:[Troværdig information (0-1)]])","v":1},1,1,0,0,{"$f":"SUM(Table1[[#This Row],[Rettigheder (0-2)]:[Troværdig information (0-1)]])","v":2},1,1,0,0,2,0]
["Helsingør",0,1,0,1,{"$f":"SUM(Table13[[#This Row],[Rettigheder (0-2)]:[Troværdig information (0-1)]])","v":2},1,1,0,1,{"$f":"SUM(Table1[[#This Row],[Rettigheder (0-2)]:[Troværdig information (0-1)]])","v":3},0,0,0,0,0,1]
["Herlev",0,1,0,0,{"$f":"SUM(Table13[[#This Row],[Rettigheder (0-2)]:[Troværdig information (0-1)]])","v":1},1,1,0,0,{"$f":"SUM(Table1[[#This Row],[Rettigheder (0-2)]:[Troværdig information (0-1)]])","v":2},"N/A","N/A","N/A",0,".",0]
["Herning",1,1,0,1,{"$f":"SUM(Table13[[#This Row],[Rettigheder (0-2)]:[Troværdig information (0-1)]])","v":3},1,1,0,0,{"$f":"SUM(Table1[[#This Row],[Rettigheder (0-2)]:[Troværdig information (0-1)]])","v":2},0,0,0,0,{"$f":"SUM(L35+M35+N35+O35)","v":0},1]
["Hillerød",0,1,0,1,{"$f":"SUM(Table13[[#This Row],[Rettigheder (0-2)]:[Troværdig information (0-1)]])","v":2},1,1,0,1,{"$f":"SUM(Table1[[#This Row],[Rettigheder (0-2)]:[Troværdig information (0-1)]])","v":3},0,0,0,1,1,0]
["Hjørring",0,1,0,1,{"$f":"SUM(Table13[[#This Row],[Rettigheder (0-2)]:[Troværdig information (0-1)]])","v":2},0,1,0,0,{"$f":"SUM(Table1[[#This Row],[Rettigheder (0-2)]:[Troværdig information (0-1)]])","v":1},0,0,0,0,0,1]
["Holbæk",0,1,0,1,{"$f":"SUM(Table13[[#This Row],[Rettigheder (0-2)]:[Troværdig information (0-1)]])","v":2},0,0,1,1,{"$f":"SUM(Table1[[#This Row],[Rettigheder (0-2)]:[Troværdig information (0-1)]])","v":2},0,1,0,1,2,1]
["Holstebro",0,1,0,1,{"$f":"SUM(Table13[[#This Row],[Rettigheder (0-2)]:[Troværdig information (0-1)]])","v":2},1,1,0,0,{"$f":"SUM(Table1[[#This Row],[Rettigheder (0-2)]:[Troværdig information (0-1)]])","v":2},0,1,2,1,4,0]
["Horsens",0,1,0,1,{"$f":"SUM(Table13[[#This Row],[Rettigheder (0-2)]:[Troværdig information (0-1)]])","v":2},1,1,0,1,{"$f":"SUM(Table1[[#This Row],[Rettigheder (0-2)]:[Troværdig information (0-1)]])","v":3},0,1,0,0,1,1]
["Hvidovre",1,1,0,0,{"$f":"SUM(Table13[[#This Row],[Rettigheder (0-2)]:[Troværdig information (0-1)]])","v":2},1,1,0,1,{"$f":"SUM(Table1[[#This Row],[Rettigheder (0-2)]:[Troværdig information (0-1)]])","v":3},0,0,0,0,0,0]
["Høje-Taastrup",0,1,0,1,{"$f":"SUM(Table13[[#This Row],[Rettigheder (0-2)]:[Troværdig information (0-1)]])","v":2},2,1,0,1,{"$f":"SUM(Table1[[#This Row],[Rettigheder (0-2)]:[Troværdig information (0-1)]])","v":4},0,0,2,0,2,0]
["Hørsholm",0,1,1,1,{"$f":"SUM(Table13[[#This Row],[Rettigheder (0-2)]:[Troværdig information (0-1)]])","v":3},2,1,2,0,{"$f":"SUM(Table1[[#This Row],[Rettigheder (0-2)]:[Troværdig information (0-1)]])","v":5},0,1,0,0,1,0]
["Ikast-Brande",0,1,0,1,{"$f":"SUM(Table13[[#This Row],[Rettigheder (0-2)]:[Troværdig information (0-1)]])","v":2},1,1,0,0,{"$f":"SUM(Table1[[#This Row],[Rettigheder (0-2)]:[Troværdig information (0-1)]])","v":2},1,0,0,0,1,1]
["Ishøj",0,1,0,1,{"$f":"SUM(Table13[[#This Row],[Rettigheder (0-2)]:[Troværdig information (0-1)]])","v":2},1,1,0,1,{"$f":"SUM(Table1[[#This Row],[Rettigheder (0-2)]:[Troværdig information (0-1)]])","v":3},0,0,0,1,1,0]
["Jammerbugt",0,1,0,0,{"$f":"SUM(Table13[[#This Row],[Rettigheder (0-2)]:[Troværdig information (0-1)]])","v":1},1,"N/A",0,0,{"$f":"SUM(Table1[[#This Row],[Rettigheder (0-2)]:[Troværdig information (0-1)]])","v":1},1,0,0,0,1,1]
["Kalundborg",0,0,0,0,{"$f":"SUM(Table13[[#This Row],[Rettigheder (0-2)]:[Troværdig information (0-1)]])","v":0},0,1,0,0,{"$f":"SUM(Table1[[#This Row],[Rettigheder (0-2)]:[Troværdig information (0-1)]])","v":1},0,0,0,0,0,0]
["Kerteminde",1,1,0,0,{"$f":"SUM(Table13[[#This Row],[Rettigheder (0-2)]:[Troværdig information (0-1)]])","v":2},1,0,0,0,{"$f":"SUM(Table1[[#This Row],[Rettigheder (0-2)]:[Troværdig information (0-1)]])","v":1},0,0,0,0,0,0]
["Kolding",0,1,0,0,{"$f":"SUM(Table13[[#This Row],[Rettigheder (0-2)]:[Troværdig information (0-1)]])","v":1},1,1,0,1,{"$f":"SUM(Table1[[#This Row],[Rettigheder (0-2)]:[Troværdig information (0-1)]])","v":3},0,0,0,0,0,1]
["København",0,0,0,0,{"$f":"SUM(Table13[[#This Row],[Rettigheder (0-2)]:[Troværdig information (0-1)]])","v":0},1,1,2,0,{"$f":"SUM(Table1[[#This Row],[Rettigheder (0-2)]:[Troværdig information (0-1)]])","v":4},0,0,0,0,0,1]
["Køge",0,1,1,1,{"$f":"SUM(Table13[[#This Row],[Rettigheder (0-2)]:[Troværdig information (0-1)]])","v":3},1,1,0,1,{"$f":"SUM(Table1[[#This Row],[Rettigheder (0-2)]:[Troværdig information (0-1)]])","v":3},0,1,0,1,2,0]
["Langeland",0,1,0,0,{"$f":"SUM(Table13[[#This Row],[Rettigheder (0-2)]:[Troværdig information (0-1)]])","v":1},2,"N/A",0,1,{"$f":"SUM(Table1[[#This Row],[Rettigheder (0-2)]:[Troværdig information (0-1)]])","v":3},0,0,0,0,0,0]
["Lejre",0,1,0,0,{"$f":"SUM(Table13[[#This Row],[Rettigheder (0-2)]:[Troværdig information (0-1)]])","v":1},1,0,0,0,{"$f":"SUM(Table1[[#This Row],[Rettigheder (0-2)]:[Troværdig information (0-1)]])","v":1},0,0,0,0,0,0]
["Lemvig",0,1,0,0,{"$f":"SUM(Table13[[#This Row],[Rettigheder (0-2)]:[Troværdig information (0-1)]])","v":1},2,1,0,1,{"$f":"SUM(Table1[[#This Row],[Rettigheder (0-2)]:[Troværdig information (0-1)]])","v":4},0,0,0,0,0,0]
["Lolland",0,1,0,0,{"$f":"SUM(Table13[[#This Row],[Rettigheder (0-2)]:[Troværdig information (0-1)]])","v":1},0,0,0,0,{"$f":"SUM(Table1[[#This Row],[Rettigheder (0-2)]:[Troværdig information (0-1)]])","v":0},0,0,0,0,0,0]
["Lyngby-Taarbæk",0,1,0,1,{"$f":"SUM(Table13[[#This Row],[Rettigheder (0-2)]:[Troværdig information (0-1)]])","v":2},1,1,0,1,{"$f":"SUM(Table1[[#This Row],[Rettigheder (0-2)]:[Troværdig information (0-1)]])","v":3},"N/A","N/A","N/A","N/A",{"$error":"#VALUE!"},0]
["Læsø",0,0,0,0,{"$f":"SUM(Table13[[#This Row],[Rettigheder (0-2)]:[Troværdig information (0-1)]])","v":0},1,"N/A",0,0,{"$f":"SUM(Table1[[#This Row],[Rettigheder (0-2)]:[Troværdig information (0-1)]])","v":1},0,0,0,0,0,0]
["Mariagerfjord",0,1,0,1,{"$f":"SUM(Table13[[#This Row],[Rettigheder (0-2)]:[Troværdig information (0-1)]])","v":2},1,1,0,1,{"$f":"SUM(Table1[[#This Row],[Rettigheder (0-2)]:[Troværdig information (0-1)]])","v":3},1,0,0,1,2,1]
["Middelfart",0,0,0,0,{"$f":"SUM(Table13[[#This Row],[Rettigheder (0-2)]:[Troværdig information (0-1)]])","v":0},0,1,0,0,{"$f":"SUM(Table1[[#This Row],[Rettigheder (0-2)]:[Troværdig information (0-1)]])","v":1},0,0,0,1,1,1]
["Morsø",0,1,0,0,{"$f":"SUM(Table13[[#This Row],[Rettigheder (0-2)]:[Troværdig information (0-1)]])","v":1},1,1,0,0,{"$f":"SUM(Table1[[#This Row],[Rettigheder (0-2)]:[Troværdig information (0-1)]])","v":2},0,0,0,0,0,0]
{"$rows_left_out":75}