{"text_format":"1","workbook":"xlsx","n_sheets":4,"sheets":["Status i din kommune","Sammenligning med andre","Grunddata","Grunddata_links"],"not_rendered":{"charts":3,"images":0,"macros":1,"external_links":0,"defined_names":0,"comments":2,"pivot_tables":0},"unopened":[],"bounds":{"document_bytes":16777216,"sheet_cells":100000,"rows_first":2000,"rows_last":500,"rows_between":2000,"halvings":0,"cell_chars":16384,"cell_head_chars":4096},"cells_cut":0,"cells_raw":0,"read":"whole","date_system":"1900"}

{"sheet":"Status i din kommune","index":0,"n_rows":124,"n_cols":10,"rows_kept":124,"cut":false,"hidden":false,"merged":[[27,2,28,9],[4,2,4,10],[15,2,16,9],[21,2,21,5],[17,2,17,5],[5,2,5,9],[7,2,10,9]]}
[]
[]
[]
[null,null,"Kære læser"]
[null,null,"Dette beregningsværktøj er DI's vejledning til at se, hvordan din kommune klarer sig i forhold til at samarbejde med private virksomheder om kommunale opgaver."]
[null,null,"Private virksomheder kan bidrage med erfaring, know-how, stordriftsfordele testet på et internationalt marked og meget andet. Alt sammen til gavn for din kommunes økonomi og leveringen af kommunale ydelser. "]
[null,null,"Sådan fungerer det:"]
[null,null,"Arket er inddelt i to sektioner. Den første fane \"Status i din kommune\", som du befinder dig i nu, går i dybden med netop din kommune, og hvordan den klarer sig. Den anden fane \"Sammenligning med andre\" viser, hvordan din kommune klarer sig sammenlignet med andre kommuner. Du kan selv vælge, hvilke kommuner, som du ønsker at sammenligne med. Beregninger er foretaget på baggrund af kommunernes regnskaber modtaget af Danmarks Statistik og kommunernes egne vundne bud modtaget fra Indenrigs- og Boligministeriet. Nøgletal herfra til beregning af Indikatoren-for-Konkurrenceudsættelse er angivet i fanen \"Grunddata\"."]
[]
[]
[]
[null,null,"Vælg din kommune her:","Albertslund"]
[]
[]
[null,null,"Hvordan kommer jeg i gang?"]
[null,null,"Forhåbentlig giver beregningerne dig nogle spændende resultater, og viser potentialer for at skabe mere samarbejde med virksomhederne. Du kan se mere om, hvordan andre kommuner har samarbejdet med private virksomheder til gavn for borgere og kommunerne ved at læse vores gode eksempler her."]
[]
[null,null,{"$f":"HYPERLINK(VLOOKUP('Status i din kommune'!D12,Grunddata_links!A:B,2,FALSE),\"Hvis du vil blive klogere på din egen kommunes udvikling, finder du mere information her.\")","v":"Hvis du vil blive klogere på din egen kommunes udvikling, finder du mere information her."}]
[]
[]
[]
[null,null,"Vi har også samlet en række anbefalinger med gode råd, som du kan læse her."]
[]
[]
[null,null,"Hvis du holder musen over opgaveområderne og nøgletallene, kan du læse en uddybende forklaring."]
[]
[]
[null,null,"Hvis du har spørgsmål eller ønsker at vide mere om, hvordan du i din kommune kan udbrede viden om det frie valg, skal du endelig ikke tøve med at kontakte os "]
[]
[null,null,"Christian Broholm Andersen"]
[null,null,"Konsulent, Offentlig/Privat og velfærdspolitik"]
[null,null,"Direkte: +45 3377 3516"]
[null,null,"Mobil: +45 5218 5959"]
[null,null,"E-mail: chra@di.dk"]
[]
[]
[]
[]
[]
[]
{"$rows_left_out":85}
{"sheet":"Sammenligning med andre","index":1,"n_rows":31,"n_cols":9,"rows_kept":31,"cut":false,"hidden":false,"merged":[[41,7,44,9]]}
[]
[null,null,"I dette ark har du mulighed for at se nærmere på din egen kommune sammenholdt med tre andre efter dit eget valg."]
[]
[null,null,"Vælg de tre kommuner her:","Gribskov"]
[null,null,null,"Holbæk"]
[null,null,null,"Ballerup"]
[]
[null,null,"Hvis du holder musen over opgaveområderne og nøgletallene, kan du læse en uddybende forklaring."]
[]
[]
[]
[null,null,null,"Tabel 2 - Din egen og udvalgte tre kommuners konkurrenceudsættelse fordelt på opgaveområder i 2021"]
[]
[null,null,null,"IKU, pct.",{"$f":"'Status i din kommune'!D12","v":"Albertslund"},{"$f":"D4","v":"Gribskov"},{"$f":"D5","v":"Holbæk"},{"$f":"D6","v":"Ballerup"},"Best practice"]
[null,null,null,"Byudvikling",{"$f":"VLOOKUP('Status i din kommune'!D12,Table1[#All],8,FALSE)","v":23.097030708061926},{"$f":"VLOOKUP($D$4,Table1[#All],8,FALSE)","v":67.177610429481973},{"$f":"VLOOKUP($D$5,Table1[#All],8,FALSE)","v":45.793472271154592},{"$f":"VLOOKUP($D$6,Table1[#All],8,FALSE)","v":33.351244850438832},64.041312461831012]
[null,null,null,"Trafik og infrastruktur",{"$f":"VLOOKUP('Status i din kommune'!D12,Table1[#All],11,FALSE)","v":39.854186478286465},{"$f":"VLOOKUP($D$4,Table1[#All],11,FALSE)","v":90.792811839323463},{"$f":"VLOOKUP($D$5,Table1[#All],11,FALSE)","v":58.855034780096446},{"$f":"VLOOKUP($D$6,Table1[#All],11,FALSE)","v":72.199906820957722},88.023699976333702]
[null,null,null,"Undervisning og kultur",{"$f":"VLOOKUP('Status i din kommune'!D12,Table1[#All],14,FALSE)","v":18.742478257907763},{"$f":"VLOOKUP($D$4,Table1[#All],14,FALSE)","v":38.306951396050756},{"$f":"VLOOKUP($D$5,Table1[#All],14,FALSE)","v":32.872405221657033},{"$f":"VLOOKUP($D$6,Table1[#All],14,FALSE)","v":15.530305744013717},43.334666950685815]
[null,null,null,"Sundhed",{"$f":"VLOOKUP('Status i din kommune'!D12,Table1[#All],17,FALSE)","v":19.973651974946264},{"$f":"VLOOKUP($D$4,Table1[#All],17,FALSE)","v":40.157798907546024},{"$f":"VLOOKUP($D$5,Table1[#All],17,FALSE)","v":11.008261754862266},{"$f":"VLOOKUP($D$6,Table1[#All],17,FALSE)","v":15.101827676240209},30.758173842338557]
[null,null,null,"Sociale opgaver",{"$f":"VLOOKUP('Status i din kommune'!D12,Table1[#All],20,FALSE)","v":30.869784960994089},{"$f":"VLOOKUP($D$4,Table1[#All],20,FALSE)","v":62.811791811095532},{"$f":"VLOOKUP($D$5,Table1[#All],20,FALSE)","v":40.081040176505162},{"$f":"VLOOKUP($D$6,Table1[#All],20,FALSE)","v":25.399050253607218},40.220656319589935]
[null,null,null,"Administration",{"$f":"VLOOKUP('Status i din kommune'!D12,Table1[#All],23,FALSE)","v":18.578597508063591},{"$f":"VLOOKUP($D$4,Table1[#All],23,FALSE)","v":24.586241212974056},{"$f":"VLOOKUP($D$5,Table1[#All],23,FALSE)","v":23.834324360706113},{"$f":"VLOOKUP($D$6,Table1[#All],23,FALSE)","v":25.933086419753089},29.641748827521997]
[null,null,null,"Samlet ",{"$f":"VLOOKUP('Status i din kommune'!D12,Table1[#All],5,FALSE)","v":26.852967934446792},{"$f":"VLOOKUP($D$4,Table1[#All],5,FALSE)","v":53.820768533370533},{"$f":"VLOOKUP($D$5,Table1[#All],5,FALSE)","v":36.482376590924886},{"$f":"VLOOKUP($D$6,Table1[#All],5,FALSE)","v":25.225943874466321},41.832400356544426]
[null,null,null,"Kilde: Danmarks Statistik, Indenrigs- og Boligministeriet samt DI-beregninger."]
[]
[]
[]
[null,null,null,"Tabel 3 - Din egen og udvalgte tre kommuners konkurrenceudsættelse samlet set  i 2021"]
[null,null,null,null,{"$f":"E14","v":"Albertslund"},{"$f":"F14","v":"Gribskov"},"Holbæk","Ballerup"]
[null,null,null,"Udbudte opgaver, mio. kr.",{"$f":"VLOOKUP(E$27,Grunddata!$1:$1048576,3,FALSE)/1000","v":432.41199999999998},{"$f":"VLOOKUP(F$27,Grunddata!$1:$1048576,3,FALSE)/1000","v":964.67},{"$f":"VLOOKUP(G$27,Grunddata!$1:$1048576,3,FALSE)/1000","v":1081.28},{"$f":"VLOOKUP(H$27,Grunddata!$1:$1048576,3,FALSE)/1000","v":678.00400000000002}]
[null,null,null,"Udbudsegnede opgaver, mio. kr.",{"$f":"VLOOKUP(E$27,Grunddata!$1:$1048576,4,FALSE)/1000","v":1610.2950000000001},{"$f":"VLOOKUP(F$27,Grunddata!$1:$1048576,4,FALSE)/1000","v":1792.375},{"$f":"VLOOKUP(G$27,Grunddata!$1:$1048576,4,FALSE)/1000","v":2963.8420000000001},{"$f":"VLOOKUP(H$27,Grunddata!$1:$1048576,4,FALSE)/1000","v":2687.7249999999999}]
[null,null,null,"IKU, pct.",{"$f":"VLOOKUP(E$27,Grunddata!$1:$1048576,5,FALSE)","v":26.852967934446792},{"$f":"VLOOKUP(F$27,Grunddata!$1:$1048576,5,FALSE)","v":53.820768533370533},{"$f":"VLOOKUP(G$27,Grunddata!$1:$1048576,5,FALSE)","v":36.482376590924886},{"$f":"VLOOKUP(H$27,Grunddata!$1:$1048576,5,FALSE)","v":25.225943874466321}]
[null,null,null,"Kilde: Danmarks Statistik, Indenrigs- og Boligministeriet samt DI-beregninger."]

{"sheet":"Grunddata","index":2,"n_rows":100,"n_cols":23,"rows_kept":100,"cut":false,"hidden":false,"merged":[]}
["Kommune","Kommunenr.","Udbudte opgaver samlet, 1.000 kr.","Udbudsegnede opgaver samlet, 1.000 kr.","IKU, pct. samlet","Udbudte opgaver Byudvikling, 1.000 kr.","Udbudsegnede opgaver Byudvikling, 1.000 kr.","IKU, pct. Byudvikling","Udbudte opgaver Trafik og Infrastruktur, 1.000 kr.","Udbudsegnede opgaver Trafik og Infrastruktur, 1.000 kr.","IKU, pct. Trafik og Infrastruktur","Udbudte opgaver Undervisning og kultur, 1.000 kr.","Udbudsegnede opgaver Undervisning og kultur, 1.000 kr.","IKU, pct. Undervisning og kultur","Udbudte opgaver Sundhed, 1.000 kr.","Udbudsegnede opgaver Sundhed, 1.000 kr.","IKU, pct. Sundhed","Udbudte opgaver Sociale opgaver, 1.000 kr.","Udbudsegnede opgaver Sociale opgaver, 1.000 kr.","IKU, pct. Sociale opgaver","Udbudte opgaver Administration, 1.000 kr.","Udbudsegnede opgaver Administration, 1.000 kr.","IKU, pct. Administration"]
["Albertslund",165,432412,1610295,26.852967934446792,27303,118210,23.097030708061926,26403,66249,39.854186478286465,41270,220195,18.742478257907763,8642,43267,19.973651974946264,283405,918066,30.869784960994089,45389,244308,18.578597508063591]
["Allerød",201,339300,1169970,29.000743608810481,7933,24185,32.801323134174076,32744,49617,65.993510288812303,50474,193951,26.02409887033323,4494,26804,16.766154305327564,212351,711932,29.827427338566043,31304,163481,19.148402566659122]
["Assens",420,484846,1678810,28.880337858363959,25252,48366,52.210230327089278,28707,88532,32.425563638006601,97856,236569,41.364675845102269,6708,52408,12.79957258433827,270748,969534,27.92558074291361,55575,283401,19.610022547556287]
["Ballerup",151,678004,2687725,25.225943874466321,26068,78162,33.351244850438832,57339,79417,72.199906820957722,65033,418749,15.530305744013717,13014,86175,15.101827676240209,411521,1620222,25.399050253607218,105029,405000,25.933086419753089]
["Billund",530,278943,1138962,24.490983895863074,14193,19853,71.490454843096757,21033,66037,31.8503263322077,53985,166531,32.417387753631452,4480,44284,10.116520639508627,141085,644649,21.885553223537148,44167,197608,22.350815756447105]
["Bornholm",400,424649,2033936,20.878188890899221,36061,102101,35.318948883948245,35168,182576,19.262115502585225,67940,232075,29.275018851664331,7917,53433,14.816686317444274,202831,1112976,18.224202498526473,74732,350775,21.304825030290072]
["Brøndby",153,509606,1951975,26.107199118841173,28146,54731,51.426065666624034,24014,56367,42.602941437365835,48362,198573,24.354771293176817,11021,77350,14.248222365869426,363631,1283727,28.326193964916218,34432,281227,12.243490134304317]
["Brønderslev",810,577557,1581400,36.52187934741368,22221,64380,34.515377446411925,25705,63236,40.649313682079828,47887,175799,27.239631624753269,13721,54921,24.983157626408843,417453,977983,42.685097798223488,50570,245081,20.633994475295921]
["Dragør",155,182577,597195,30.572426091980002,6973,25390,27.463568333989759,7448,33927,21.953016771303091,20219,68817,29.380821599314121,3691,14514,25.43061871296679,118702,354218,33.511001699518381,25544,100329,25.460235824138582]
["Egedal",240,477133,1736905,27.470299181590242,26601,68034,39.099567863127263,37106,53840,68.919019316493319,85596,215188,39.777311002472253,2527,49884,5.0657525459065029,269387,1031995,26.103517943400888,55916,317964,17.585638625756374]
["Esbjerg",561,1159316,4898490,23.666803443510144,121626,186290,65.288528638144825,145493,264478,55.011380908809052,143675,584600,24.576633595620937,14531,169856,8.5548935568952533,627928,3005237,20.894458573483554,106063,688029,15.415483940357166]
["Fanø",563,88036,205711,42.795961324382262,2246,5186,43.308908600077132,38830,47047,82.534486789805939,5807,10906,53.245919677241879,5178,10933,47.361200036586482,24654,95427,25.835455374265141,11321,36212,31.26311719871866]
["Favrskov",710,459521,1840339,24.96936705683029,22719,46957,48.382562770194006,55645,69970,79.526940117193078,92869,261540,35.508526420432823,7794,66572,11.707624827254701,232222,1117759,20.775677046662118,48272,277541,17.392745576329265]
["Faxe",320,470901,1586417,29.683305209160011,35697,120070,29.730157408178563,27881,54036,51.597083425864241,51333,178547,28.75041305650613,8376,51186,16.363849490094946,287369,936035,30.700668244243001,60245,246543,24.435899619944593]
["Fredensborg",210,586353,1917929,30.572195321098956,34169,84456,40.457753149569008,26787,72728,36.831756682433173,69984,279407,25.04733238608911,8223,60355,13.624389031563251,397577,1154841,34.426990382225782,49613,266142,18.641552254059864]
["Fredericia",607,516211,2301783,22.42657105383088,28533,125713,22.696936673215976,42677,55795,76.488932700062733,40243,339085,11.868115664213988,14152,70927,19.952909329310415,303535,1344703,22.572642434797871,87071,365560,23.81852500273553]
["Frederiksberg",147,1187590,4232019,28.062019570328019,81891,166738,49.113579388021925,102188,173266,58.97752588505535,148450,578548,25.659063725049609,20698,147764,14.00747137327089,721097,2539976,28.389913920446492,113266,625727,18.101504330163152]
["Frederikshavn",813,657536,2646844,24.842264976704332,37296,91849,40.605776872910972,73182,121289,60.336881333014539,58365,251034,23.249838667272162,26482,96632,27.405000413941551,364929,1658967,21.997363419525524,97282,427073,22.778775525495643]
["Frederikssund",250,616022,2105139,29.262770771906272,27641,76135,36.305247258159845,60483,66703,90.67508208026625,81746,340487,24.008552455747211,9376,68361,13.715422536241423,365152,1233303,29.607647106996417,71624,320150,22.372013118850539]
["Furesø",190,469237,1871514,25.072588289481136,21763,98542,22.084999289642994,33681,58188,57.883068673953396,69147,270491,25.563512279521316,6976,61358,11.36934059128394,292463,1111950,26.301812131840464,45207,270985,16.682473199623598]
["Faaborg-Midtfyn",430,623781,2175848,28.668408822675111,21856,94130,23.218952512482737,74622,121620,61.356684755796742,88887,257229,34.555590543834484,8609,78556,10.959061051988391,340714,1262683,26.983336276801069,89093,361630,24.636506926969552]
["Gentofte",157,1037298,3509706,29.555125130139103,101327,234868,43.142105352793905,84719,177530,47.720948572072324,104272,502197,20.763166645758538,25095,150862,16.63440760430062,628014,2033540,30.882795519143958,93871,410709,22.855841970835801]
["Gladsaxe",159,795549,3262812,24.382311944420948,51426,124637,41.260620842927864,88412,119690,73.867491018464364,72160,452333,15.952848896719896,19940,159352,12.513178372408253,480813,1918214,25.065660035845845,82798,488586,16.946453643780217]
["Glostrup",161,299659,1102769,27.173324603792814,16575,70323,23.569813574506206,11706,47960,24.407839866555463,22045,143390,15.37415440407281,4422,40436,10.935799782372143,206175,637100,32.361481714016641,38736,163560,23.683052090975789]
["Greve",253,682175,2081894,32.767038091276504,32560,57923,56.21255805120591,41748,61270,68.137750938469068,118930,350929,33.890046134688212,8253,62737,13.154916556418062,414733,1245652,33.294451419818699,65951,303383,21.738528526647833]
["Gribskov",270,964670,1792375,53.820768533370533,60392,89899,67.177610429481973,60123,66220,90.792811839323463,80974,211382,38.306951396050756,19850,49430,40.157798907546024,665756,1059922,62.811791811095532,77575,315522,24.586241212974056]
["Guldborgsund",376,937285,2845415,32.940186229425237,28000,77580,36.091776230987364,74575,147935,50.410653327474911,122763,347052,35.373085301338122,17106,92537,18.485578741476381,556119,1781407,31.217964227153033,138722,398904,34.77578565268837]
["Haderslev",510,690658,2567683,26.898102296895683,26533,98636,26.899914838395716,66325,151136,43.884316112640271,89328,310200,28.796905222437136,15563,88279,17.629334269758377,403190,1469481,27.437578301454728,89719,449951,19.939726770248317]
["Halsnæs",260,416989,1451155,28.734973176538688,15872,41676,38.084269123716282,22869,34145,66.976131205154488,47528,171521,27.709726505792293,6129,52363,11.704829746194832,277897,921394,30.160495944188913,46694,230056,20.296797301526585]
["Hedensted",766,444189,1792080,24.786226061336546,12905,24668,52.314739743797631,45031,83940,53.646652370741009,101898,251910,40.450160771704176,6717,51515,13.038920702707948,224200,1106937,20.254088534397169,53438,273110,19.566475046684488]
["Helsingør",217,865336,3017500,28.67724937862469,33341,127069,26.238500342333694,116861,123946,94.283801010117301,111623,497172,22.451586171385355,9544,94665,10.081867638514764,530164,1759378,30.13360403506239,63803,415270,15.364220868350712]
["Herlev",163,349318,1356193,25.757248415232937,15313,50803,30.141920752711453,13302,47562,27.967705310962533,47376,241132,19.647330093061065,6256,51399,12.17144302418335,229614,768698,29.87050831405832,37457,196599,19.052487550801377]
["Herning",657,918076,3570854,25.710264267315324,67207,162334,41.400445994061627,109361,173598,62.996693510293902,199922,591498,33.799268974704901,16408,98449,16.666497374275004,416590,2094187,19.892683891171131,108588,450788,24.088485052840802]
["Hillerød",219,801054,2482918,32.262603920065018,45012,83473,53.924023336887373,77002,85741,89.807676607457338,177459,540096,32.856936544614292,11953,90720,13.175705467372135,398414,1340216,29.727596148680512,91214,342672,26.618457300275484]
["Hjørring",860,754777,2995787,25.194614970957545,19742,80737,24.452233796152942,72647,121624,59.730809708610145,86517,364085,23.7628575744675,13094,121776,10.752529234003417,463766,1815148,25.549762333429559,99011,492417,20.107144960470496]
["Holbæk",316,1081280,2963842,36.482376590924886,50692,110697,45.793472271154592,52966,89994,58.855034780096446,159752,485976,32.872405221657033,9407,85454,11.008261754862266,705769,1760855,40.081040176505162,102694,430866,23.834324360706113]
["Holstebro",661,819663,2630206,31.163452596488639,46834,87169,53.727816081405088,97680,103253,94.602578133323007,136206,445482,30.574972726170756,6767,62116,10.894133556571575,443202,1632716,27.14507605731799,88974,299470,29.710488529735869]
["Horsens",615,1053931,3757210,28.050894147519035,43783,124676,35.117424363951358,126579,220992,57.2776390095569,140182,555197,25.249055740574967,10057,138319,7.2708738495795959,590236,2221637,26.567616581826826,121697,496389,24.516457858655208]
["Hvidovre",167,641587,2631063,24.385086940145484,40276,143912,27.986547334482182,56209,105867,53.093976404356411,58786,339161,17.332771161778624,13362,79506,16.806278771413478,402905,1582743,25.456122693324186,70049,379874,18.440061704670498]
{"$rows_left_out":61}
{"sheet":"Grunddata_links","index":3,"n_rows":99,"n_cols":2,"rows_kept":99,"cut":false,"hidden":true,"merged":[]}
["Name","Link"]
["Albertslund","https://www.danskindustri.dk/offentlig-privatsamarbejde/opsstatus/Albertslund"]
["Allerød","https://www.danskindustri.dk/offentlig-privatsamarbejde/opsstatus/Alleroed"]
["Assens","https://www.danskindustri.dk/offentlig-privatsamarbejde/opsstatus/Assens"]
["Ballerup","https://www.danskindustri.dk/offentlig-privatsamarbejde/opsstatus/Ballerup"]
["Billund","https://www.danskindustri.dk/offentlig-privatsamarbejde/opsstatus/Billund"]
["Bornholm","https://www.danskindustri.dk/offentlig-privatsamarbejde/opsstatus/Bornholm"]
["Brøndby","https://www.danskindustri.dk/offentlig-privatsamarbejde/opsstatus/Broendby"]
["Brønderslev","https://www.danskindustri.dk/offentlig-privatsamarbejde/opsstatus/Broenderslev"]
["Dragør","https://www.danskindustri.dk/offentlig-privatsamarbejde/opsstatus/Dragoer"]
["Egedal","https://www.danskindustri.dk/offentlig-privatsamarbejde/opsstatus/Egedal"]
["Esbjerg","https://www.danskindustri.dk/offentlig-privatsamarbejde/opsstatus/Esbjerg"]
["Fanø","https://www.danskindustri.dk/offentlig-privatsamarbejde/opsstatus/Fanoe"]
["Favrskov","https://www.danskindustri.dk/offentlig-privatsamarbejde/opsstatus/Favrskov"]
["Faxe","https://www.danskindustri.dk/offentlig-privatsamarbejde/opsstatus/Faxe"]
["Fredensborg","https://www.danskindustri.dk/offentlig-privatsamarbejde/opsstatus/Fredensborg"]
["Fredericia","https://www.danskindustri.dk/offentlig-privatsamarbejde/opsstatus/Fredericia"]
["Frederiksberg","https://www.danskindustri.dk/offentlig-privatsamarbejde/opsstatus/Frederiksberg"]
["Frederikshavn","https://www.danskindustri.dk/offentlig-privatsamarbejde/opsstatus/Frederikshavn"]
["Frederikssund","https://www.danskindustri.dk/offentlig-privatsamarbejde/opsstatus/Frederikssund"]
["Furesø","https://www.danskindustri.dk/offentlig-privatsamarbejde/opsstatus/Furesoe"]
["Faaborg-Midtfyn","https://www.danskindustri.dk/offentlig-privatsamarbejde/opsstatus/Faaborg-Midtfyn "]
["Gentofte","https://www.danskindustri.dk/offentlig-privatsamarbejde/opsstatus/Gentofte"]
["Gladsaxe","https://www.danskindustri.dk/offentlig-privatsamarbejde/opsstatus/Gladsaxe"]
["Glostrup","https://www.danskindustri.dk/offentlig-privatsamarbejde/opsstatus/Glostrup"]
["Greve","https://www.danskindustri.dk/offentlig-privatsamarbejde/opsstatus/Greve"]
["Gribskov","https://www.danskindustri.dk/offentlig-privatsamarbejde/opsstatus/Gribskov"]
["Guldborgsund","https://www.danskindustri.dk/offentlig-privatsamarbejde/opsstatus/Guldborgsund"]
["Haderslev","https://www.danskindustri.dk/offentlig-privatsamarbejde/opsstatus/Haderslev"]
["Halsnæs","https://www.danskindustri.dk/offentlig-privatsamarbejde/opsstatus/Halsnaes"]
["Hedensted","https://www.danskindustri.dk/offentlig-privatsamarbejde/opsstatus/Hedensted"]
["Helsingør","https://www.danskindustri.dk/offentlig-privatsamarbejde/opsstatus/Helsingoer"]
["Herlev","https://www.danskindustri.dk/offentlig-privatsamarbejde/opsstatus/Herlev"]
["Herning","https://www.danskindustri.dk/offentlig-privatsamarbejde/opsstatus/Herning"]
["Hillerød","https://www.danskindustri.dk/offentlig-privatsamarbejde/opsstatus/Hilleroed"]
["Hjørring","https://www.danskindustri.dk/offentlig-privatsamarbejde/opsstatus/Hjoerring"]
["Holbæk","https://www.danskindustri.dk/offentlig-privatsamarbejde/opsstatus/Holbaek"]
["Holstebro","https://www.danskindustri.dk/offentlig-privatsamarbejde/opsstatus/Holstebro"]
["Horsens","https://www.danskindustri.dk/offentlig-privatsamarbejde/opsstatus/Horsens"]
["Hvidovre","https://www.danskindustri.dk/offentlig-privatsamarbejde/opsstatus/Hvidovre"]
{"$rows_left_out":59}